{"text_format":"1","workbook":"xlsx","n_sheets":8,"sheets":["Decision Table","Utility","Weights","Weight Sensitivity","Scenarios","Utable","Performance","Module1"],"not_rendered":{"charts":4,"images":11,"macros":1,"external_links":0,"defined_names":60,"comments":0,"pivot_tables":0},"unopened":[{"sheet":"Module1","index":7,"reason":"part_missing"}],"bounds":{"document_bytes":16777216,"sheet_cells":100000,"rows_first":2000,"rows_last":500,"rows_between":2000,"halvings":0,"cell_chars":16384,"cell_head_chars":4096},"cells_cut":0,"cells_raw":0,"read":"whole","date_system":"1900"}

{"sheet":"Decision Table","index":0,"n_rows":35,"n_cols":15,"rows_kept":35,"cut":false,"hidden":false,"merged":[]}
["Pro&Con",null,null,null,null,"© Fred Wenstøp 10. november 2010"]
["1: Hak av den første ruten for å legge inn det første resultatmålet, og fortsett nedover. Du kan legge til eller fjerne resultatmål senere."]
["2: Et resultatmål representerer enten et onde (kostnad) eller et gode som du vil ha mest mulig av."]
["3: Overskriv \"Alt. 1\" osv med de virkelige navnene på alternativene dine. Du kan legge til flere senere. "]
["4: Skriv inn skårene i beslutningstabellen. Dette må være tall. Pass på å bruke riktig desimaltegn."]
["5: Klikk på fanen \"Utility\" og følg videre instruksjoner inntil du kommer tilbake hit."]
["6: Vektene blir utesket i arket som kalles \"Weights\". De vil komme til syne i dette arket sammen med resultatet for hvert alternativ. "]
["7: For å beregne betalingsvillighet i kroner må du trykke på en radioknapp med monetært resultatmål."]
[null,null,null,null,null,"BESLUTNINGSTABELL"]
["BV","Vekt","Resultatmål",null,null,"Alt. 1","Alt. 2","Alt. 3","Alt. 4","Alt. 5","Alt. 6","Alt. 7","Alt. 8","Alt. 9","Alt. 10"]
{"$rows_left_out":26}
{"sheet":"Utility","index":1,"n_rows":24,"n_cols":24,"rows_kept":24,"cut":false,"hidden":false,"merged":[]}
[null,null,null,null,null,null,"Linearity","pa","pc","Worst","Middle","Best","Punktnytte"]
[null,null,null,null,null,{"$f":"'Decision Table'!C11","v":0},"Yes",null,null,{"$f":"IF('Decision Table'!D11=\"b\",MIN('Decision Table'!F11:'Decision Table'!O11),IF('Decision Table'!D11=\"c\",MAX('Decision Table'!F11:'Decision Table'!O11),\"\"))","v":""},{"$f":"IF(ISTEXT(J2),\"\",(J2+L2)/2)","v":""},{"$f":"IF('Decision Table'!D11=\"c\",MIN('Decision Table'!F11:'Decision Table'!O11),IF('Decision Table'!D11=\"b\",MAX('Decision Table'!F11:'Decision Table'!O11),\"\"))","v":""},{"$f":"INDEX(_xlnm.Criteria,No)","v":0}]
[null,null,null,null,null,{"$f":"'Decision Table'!C12","v":0},"Yes",null,null,{"$f":"IF('Decision Table'!D12=\"b\",MIN('Decision Table'!F12:'Decision Table'!O12),IF('Decision Table'!D12=\"c\",MAX('Decision Table'!F12:'Decision Table'!O12),\"\"))","v":""},"",{"$f":"IF('Decision Table'!D12=\"c\",MIN('Decision Table'!F12:'Decision Table'!O12),IF('Decision Table'!D12=\"b\",MAX('Decision Table'!F12:'Decision Table'!O12),\"\"))","v":""},"Score",{"$f":"INDEX(Worst,No)","v":""},{"$f":"$N$3+($X$3-$N$3)/10","v":{"$error":"#VALUE!"}},{"$f":"$N$3+2*($X$3-$N$3)/10","v":{"$error":"#VALUE!"}},{"$f":"$N$3+3*($X$3-$N$3)/10","v":{"$error":"#VALUE!"}},{"$f":"$N$3+4*($X$3-$N$3)/10","v":{"$error":"#VALUE!"}},{"$f":"$N$3+5*($X$3-$N$3)/10","v":{"$error":"#VALUE!"}},{"$f":"$N$3+6*($X$3-$N$3)/10","v":{"$error":"#VALUE!"}},{"$f":"$N$3+7*($X$3-$N$3)/10","v":{"$error":"#VALUE!"}},{"$f":"$N$3+8*($X$3-$N$3)/10","v":{"$error":"#VALUE!"}},{"$f":"$N$3+9*($X$3-$N$3)/10","v":{"$error":"#VALUE!"}},{"$f":"INDEX(Best,No)","v":""}]
[null,null,null,null,null,{"$f":"'Decision Table'!C13","v":0},"Yes",null,null,{"$f":"IF('Decision Table'!D13=\"b\",MIN('Decision Table'!F13:'Decision Table'!O13),IF('Decision Table'!D13=\"c\",MAX('Decision Table'!F13:'Decision Table'!O13),\"\"))","v":""},"",{"$f":"IF('Decision Table'!D13=\"c\",MIN('Decision Table'!F13:'Decision Table'!O13),IF('Decision Table'!D13=\"b\",MAX('Decision Table'!F13:'Decision Table'!O13),\"\"))","v":""},"Utility",{"$f":"IF(INDEX($G$2:$G$16,No)=\"Yes\",(N3-INDEX(Worst,No))/(INDEX(Best,No)-INDEX(Worst,No)),INDEX(pa,No)*(1-EXP(INDEX(pc,No)*(N3-INDEX(Worst,No))/(INDEX(Best,No)-INDEX(Worst,No)))))","v":{"$error":"#VALUE!"}},{"$error":"#VALUE!"},{"$error":"#VALUE!"},{"$error":"#VALUE!"},{"$error":"#VALUE!"},{"$error":"#VALUE!"},{"$error":"#VALUE!"},{"$error":"#VALUE!"},{"$error":"#VALUE!"},{"$error":"#VALUE!"},{"$error":"#VALUE!"}]
[null,null,null,null,null,{"$f":"'Decision Table'!C14","v":0},"Yes",null,null,{"$f":"IF('Decision Table'!D14=\"b\",MIN('Decision Table'!F14:'Decision Table'!O14),IF('Decision Table'!D14=\"c\",MAX('Decision Table'!F14:'Decision Table'!O14),\"\"))","v":""},"",{"$f":"IF('Decision Table'!D14=\"c\",MIN('Decision Table'!F14:'Decision Table'!O14),IF('Decision Table'!D14=\"b\",MAX('Decision Table'!F14:'Decision Table'!O14),\"\"))","v":""},"Minimum",{"$f":"MIN(N3,X3)","v":0}]
[null,null,null,null,null,{"$f":"'Decision Table'!C15","v":0},"Yes",null,null,{"$f":"IF('Decision Table'!D15=\"b\",MIN('Decision Table'!F15:'Decision Table'!O15),IF('Decision Table'!D15=\"c\",MAX('Decision Table'!F15:'Decision Table'!O15),\"\"))","v":""},"",{"$f":"IF('Decision Table'!D15=\"c\",MIN('Decision Table'!F15:'Decision Table'!O15),IF('Decision Table'!D15=\"b\",MAX('Decision Table'!F15:'Decision Table'!O15),\"\"))","v":""},"Maximum",{"$f":"MAX(N3,X3)","v":0}]
[null,null,null,null,null,{"$f":"'Decision Table'!C16","v":0},"Yes",null,null,{"$f":"IF('Decision Table'!D16=\"b\",MIN('Decision Table'!F16:'Decision Table'!O16),IF('Decision Table'!D16=\"c\",MAX('Decision Table'!F16:'Decision Table'!O16),\"\"))","v":""},"",{"$f":"IF('Decision Table'!D16=\"c\",MIN('Decision Table'!F16:'Decision Table'!O16),IF('Decision Table'!D16=\"b\",MAX('Decision Table'!F16:'Decision Table'!O16),\"\"))","v":""}]
[null,null,null,null,null,{"$f":"'Decision Table'!C17","v":0},"Yes",null,null,{"$f":"IF('Decision Table'!D17=\"b\",MIN('Decision Table'!F17:'Decision Table'!O17),IF('Decision Table'!D17=\"c\",MAX('Decision Table'!F17:'Decision Table'!O17),\"\"))","v":""},"",{"$f":"IF('Decision Table'!D17=\"c\",MIN('Decision Table'!F17:'Decision Table'!O17),IF('Decision Table'!D17=\"b\",MAX('Decision Table'!F17:'Decision Table'!O17),\"\"))","v":""}]
[null,null,null,null,null,{"$f":"'Decision Table'!C18","v":0},"Yes",null,null,{"$f":"IF('Decision Table'!D18=\"b\",MIN('Decision Table'!F18:'Decision Table'!O18),IF('Decision Table'!D18=\"c\",MAX('Decision Table'!F18:'Decision Table'!O18),\"\"))","v":""},"",{"$f":"IF('Decision Table'!D18=\"c\",MIN('Decision Table'!F18:'Decision Table'!O18),IF('Decision Table'!D18=\"b\",MAX('Decision Table'!F18:'Decision Table'!O18),\"\"))","v":""}]
[null,null,null,null,null,{"$f":"'Decision Table'!C19","v":0},"Yes",null,null,{"$f":"IF('Decision Table'!D19=\"b\",MIN('Decision Table'!F19:'Decision Table'!O19),IF('Decision Table'!D19=\"c\",MAX('Decision Table'!F19:'Decision Table'!O19),\"\"))","v":""},"",{"$f":"IF('Decision Table'!D19=\"c\",MIN('Decision Table'!F19:'Decision Table'!O19),IF('Decision Table'!D19=\"b\",MAX('Decision Table'!F19:'Decision Table'!O19),\"\"))","v":""}]
{"$rows_left_out":15}
{"sheet":"Weights","index":2,"n_rows":44,"n_cols":9,"rows_kept":44,"cut":false,"hidden":false,"merged":[]}
["Vektlegging"]
[{"$f":"'Decision Table'!C10","v":"Resultatmål"},"Verst","Best","Vekt","                 V e k t l e g g i n g",null,null,null,"Vekt %"]
[{"$f":"IF('Decision Table'!E11,'Decision Table'!C11,\"\")","v":""},{"$f":"Utility!J2","v":""},{"$f":"Utility!L2","v":""},0,null,null,null,null,{"$f":"D3/$D$18","v":{"$error":"#DIV/0!"}}]
[{"$f":"IF('Decision Table'!E12,'Decision Table'!C12,\"\")","v":""},{"$f":"Utility!J3","v":""},{"$f":"Utility!L3","v":""},0,null,null,null,null,{"$f":"D4/$D$18","v":{"$error":"#DIV/0!"}}]
[{"$f":"IF('Decision Table'!E13,'Decision Table'!C13,\"\")","v":""},{"$f":"Utility!J4","v":""},{"$f":"Utility!L4","v":""},0,null,null,null,null,{"$error":"#DIV/0!"}]
[{"$f":"IF('Decision Table'!E14,'Decision Table'!C14,\"\")","v":""},{"$f":"Utility!J5","v":""},{"$f":"Utility!L5","v":""},0,null,null,null,null,{"$error":"#DIV/0!"}]
[{"$f":"IF('Decision Table'!E15,'Decision Table'!C15,\"\")","v":""},{"$f":"Utility!J6","v":""},{"$f":"Utility!L6","v":""},null,null,null,null,null,{"$error":"#DIV/0!"}]
[{"$f":"IF('Decision Table'!E16,'Decision Table'!C16,\"\")","v":""},{"$f":"Utility!J7","v":""},{"$f":"Utility!L7","v":""},null,null,null,null,null,{"$error":"#DIV/0!"}]
[{"$f":"IF('Decision Table'!E17,'Decision Table'!C17,\"\")","v":""},{"$f":"Utility!J8","v":""},{"$f":"Utility!L8","v":""},null,null,null,null,null,{"$error":"#DIV/0!"}]
[{"$f":"IF('Decision Table'!E18,'Decision Table'!C18,\"\")","v":""},{"$f":"Utility!J9","v":""},{"$f":"Utility!L9","v":""},null,null,null,null,null,{"$error":"#DIV/0!"}]
{"$rows_left_out":35}
{"sheet":"Weight Sensitivity","index":3,"n_rows":48,"n_cols":9,"rows_kept":48,"cut":false,"hidden":false,"merged":[]}
["Følsomhetsanalyse - vekter"]
[{"$f":"'Decision Table'!C10","v":"Resultatmål"},"Verst","Best",null,"                 V e k t l e g g i n g",null,null,null,"Vekt %"]
[{"$f":"IF('Decision Table'!E11,'Decision Table'!C11,\"\")","v":""},{"$f":"Utility!J2","v":""},{"$f":"Utility!L2","v":""},null,null,null,null,null,{"$f":"Weights!D3/Weights!$D$18","v":{"$error":"#DIV/0!"}}]
[{"$f":"IF('Decision Table'!E12,'Decision Table'!C12,\"\")","v":""},{"$f":"Utility!J3","v":""},{"$f":"Utility!L3","v":""},null,null,null,null,null,{"$f":"Weights!D4/Weights!$D$18","v":{"$error":"#DIV/0!"}}]
[{"$f":"IF('Decision Table'!E13,'Decision Table'!C13,\"\")","v":""},{"$f":"Utility!J4","v":""},{"$f":"Utility!L4","v":""},null,null,null,null,null,{"$f":"Weights!D5/Weights!$D$18","v":{"$error":"#DIV/0!"}}]
[{"$f":"IF('Decision Table'!E14,'Decision Table'!C14,\"\")","v":""},{"$f":"Utility!J5","v":""},{"$f":"Utility!L5","v":""},null,null,null,null,null,{"$f":"Weights!D6/Weights!$D$18","v":{"$error":"#DIV/0!"}}]
[{"$f":"IF('Decision Table'!E15,'Decision Table'!C15,\"\")","v":""},{"$f":"Utility!J6","v":""},{"$f":"Utility!L6","v":""},null,null,null,null,null,{"$f":"Weights!D7/Weights!$D$18","v":{"$error":"#DIV/0!"}}]
[{"$f":"IF('Decision Table'!E16,'Decision Table'!C16,\"\")","v":""},{"$f":"Utility!J7","v":""},{"$f":"Utility!L7","v":""},null,null,null,null,null,{"$f":"Weights!D8/Weights!$D$18","v":{"$error":"#DIV/0!"}}]
[{"$f":"IF('Decision Table'!E17,'Decision Table'!C17,\"\")","v":""},{"$f":"Utility!J8","v":""},{"$f":"Utility!L8","v":""},null,null,null,null,null,{"$f":"Weights!D9/Weights!$D$18","v":{"$error":"#DIV/0!"}}]
[{"$f":"IF('Decision Table'!E18,'Decision Table'!C18,\"\")","v":""},{"$f":"Utility!J9","v":""},{"$f":"Utility!L9","v":""},null,null,null,null,null,{"$f":"Weights!D10/Weights!$D$18","v":{"$error":"#DIV/0!"}}]
{"$rows_left_out":39}
{"sheet":"Scenarios","index":4,"n_rows":37,"n_cols":11,"rows_kept":37,"cut":false,"hidden":false,"merged":[]}
["Scenarioanalyse"]
["Alternativ","Velg to"]
[{"$f":"'Decision Table'!F10","v":"Alt. 1"},null,true,{"$f":"IF(C3,1)","v":1}]
[{"$f":"'Decision Table'!G10","v":"Alt. 2"},null,true,{"$f":"IF(C4,2)","v":2}]
[{"$f":"'Decision Table'!H10","v":"Alt. 3"},null,false,{"$f":"IF(C5,3)","v":false}]
[{"$f":"'Decision Table'!I10","v":"Alt. 4"},null,false,{"$f":"IF(C6,4)","v":false}]
[{"$f":"'Decision Table'!J10","v":"Alt. 5"},null,false,{"$f":"IF(C7,5)","v":false}]
[{"$f":"'Decision Table'!K10","v":"Alt. 6"},null,false,{"$f":"IF(C8,6)","v":false}]
[{"$f":"'Decision Table'!L10","v":"Alt. 7"},null,false,{"$f":"IF(C9,7)","v":false}]
[{"$f":"'Decision Table'!M10","v":"Alt. 8"},null,false,{"$f":"IF(C10,8)","v":false}]
{"$rows_left_out":28}
{"sheet":"Utable","index":5,"n_rows":62,"n_cols":17,"rows_kept":62,"cut":false,"hidden":false,"merged":[]}
[]
[]
[]
[]
[]
[]
[]
[]
[null,null,null,"Nyttetabell for beslutningstabellen"]
[null,null,null,null,{"$f":"'Decision Table'!F10","v":"Alt. 1"},{"$f":"'Decision Table'!G10","v":"Alt. 2"},{"$f":"'Decision Table'!H10","v":"Alt. 3"},{"$f":"'Decision Table'!I10","v":"Alt. 4"},{"$f":"'Decision Table'!J10","v":"Alt. 5"},{"$f":"'Decision Table'!K10","v":"Alt. 6"},{"$f":"'Decision Table'!L10","v":"Alt. 7"},{"$f":"'Decision Table'!M10","v":"Alt. 8"},{"$f":"'Decision Table'!N10","v":"Alt. 9"},{"$f":"'Decision Table'!O10","v":"Alt. 10"}]
{"$rows_left_out":53}
{"sheet":"Performance","index":6,"n_rows":65,"n_cols":14,"rows_kept":65,"cut":false,"hidden":false,"merged":[]}
[]
[]
[]
[]
[]
[]
[]
[]
[null,null,null,"Resultatberegning for beslutningstabellen (Vekt x Nytte)"]
[null,null,null,null,{"$f":"'Decision Table'!F10","v":"Alt. 1"},{"$f":"'Decision Table'!G10","v":"Alt. 2"},{"$f":"'Decision Table'!H10","v":"Alt. 3"},{"$f":"'Decision Table'!I10","v":"Alt. 4"},{"$f":"'Decision Table'!J10","v":"Alt. 5"},{"$f":"'Decision Table'!K10","v":"Alt. 6"},{"$f":"'Decision Table'!L10","v":"Alt. 7"},{"$f":"'Decision Table'!M10","v":"Alt. 8"},{"$f":"'Decision Table'!N10","v":"Alt. 9"},{"$f":"'Decision Table'!O10","v":"Alt. 10"}]
{"$rows_left_out":55}